MAINTAINERS: MediaTek: add USB related files

Add dt-binding files of xhci-mtk and phys, C files of
phys.

Signed-off-by: Chunfeng Yun <chunfeng.yun@mediatek.com>
Reviewed-by: Weijie Gao <weijie.gao@mediatek.com>
36 jobs for master in 8 minutes and 50 seconds (queued for 3 minutes and 10 seconds)
Status Job ID Name Coverage
  Testsuites
passed #87649
all
Build envtools

00:00:16

passed #87648
all
Build tools-only

00:00:25

passed #87647
all
Check for configs without MAINTAINERS entry

00:00:17

passed #87650
all
Run binman, buildman, dtoc, Kconfig and patman testsuites

00:00:55

passed #87643
all
cppcheck

00:00:29

passed #87644
all
grep TODO/FIXME/HACK

00:00:38

passed #87645
all
htmldocs

00:00:25

passed #87646
all
sloccount

00:00:31

 
  Test.Py
passed #87654
all
evb-ast2500 test.py

00:00:53

passed #87658
all
integratorcp_cm926ejs test.py

00:00:49

passed #87665
all
qemu-ppce500 test.py

00:00:51

passed #87666
all
qemu-riscv32 test.py

00:00:55

passed #87668
all
qemu-riscv32_spl test.py

00:00:58

passed #87667
all
qemu-riscv64 test.py

00:01:14

passed #87669
all
qemu-riscv64_spl test.py

00:00:58

passed #87670
all
qemu-x86 test.py

00:01:09

passed #87671
all
qemu-x86_64 test.py

00:01:21

passed #87659
all
qemu_arm test.py

00:01:23

passed #87660
all
qemu_arm64 test.py

00:01:12

passed #87661
all
qemu_mips test.py

00:00:49

passed #87663
all
qemu_mips64 test.py

00:00:50

passed #87664
all
qemu_mips64el test.py

00:00:43

passed #87662
all
qemu_mipsel test.py

00:00:51

passed #87651
all
sandbox test.py

00:01:14

passed #87652
all
sandbox with clang test.py

00:02:13

passed #87655
all
sandbox_flattree test.py

00:01:38

passed #87653
all
sandbox_spl test.py

00:00:58

passed #87656
all
vexpress_ca15_tc2 test.py

00:00:34

passed #87657
all
vexpress_ca9x4 test.py

00:00:34

failed #87673
all
xilinx_versal_virt test.py

00:00:29

passed #87672
all
xilinx_zynq_virt test.py

00:00:57

passed #87674
all
xtfpga test.py

00:00:35

 
  World Build
skipped #87675
all
build all 32bit ARM platforms
skipped #87676
all
build all 64bit ARM platforms
skipped #87677
all
build all PowerPC platforms
skipped #87678
all
build all other platforms
 
Name Stage Failure
failed
xilinx_versal_virt test.py Test.Py
+cc1: all warnings being treated as errors
+make[2]: *** [drivers/usb/host/xhci-dwc3.o] Error 1
+make[1]: *** [drivers/usb/host] Error 2
+make: *** [sub-make] Error 2
0 0 1 /1 xilinx_versal_virt
Completed: 1 total built, duration 0:00:08
Running after script...
$ rm -rf /tmp/uboot-test-hooks /tmp/venv
ERROR: Job failed: exit code 1