cmd: CMD_ACPI depends on ACPIGEN

Trying to compile qemu-x86_64_defconfig with CONFIG_CMD_ACPI=y and
CONFIG_ACPIGEN=n fails with

ld.bfd: cmd/built-in.o: in function `do_acpi_items':
cmd/acpi.c:162: undefined reference to `acpi_dump_items'

Add the missing configuration dependency.

Signed-off-by: Heinrich Schuchardt <xypron.glpk@gmx.de>
Reviewed-by: Bin Meng <bmeng.cn@gmail.com>
45 jobs for master in 10 minutes and 56 seconds (queued for 2 seconds)
Status Job ID Name Coverage
  Testsuites
passed #207290
all
Build envtools

00:00:27

passed #207289
all
Build tools-only

00:00:37

passed #207288
all
Check for configs without MAINTAINERS entry

00:00:24

passed #207291
all
Run binman, buildman, dtoc, Kconfig and patman testsuites

00:01:31

passed #207292
all
Run tests for Nokia RX-51 (aka N900)

00:02:37

passed #207284
all
cppcheck

00:01:29

passed #207285
all
grep TODO/FIXME/HACK

00:00:57

passed #207286
all
htmldocs

00:00:32

passed #207287
all
sloccount

00:00:29

 
  Test.Py
passed #207296
all
evb-ast2500 test.py

00:00:28

passed #207300
all
integratorcp_cm926ejs test.py

00:00:30

passed #207311
all
qemu-ppce500 test.py

00:00:26

passed #207312
all
qemu-riscv32 test.py

00:00:52

passed #207314
all
qemu-riscv32_spl test.py

00:00:58

passed #207313
all
qemu-riscv64 test.py

00:00:47

passed #207315
all
qemu-riscv64_spl test.py

00:01:02

failed #207316
all
qemu-x86 test.py

00:00:19

failed #207317
all
qemu-x86_64 test.py

00:00:21

passed #207301
all
qemu_arm test.py

00:01:07

passed #207302
all
qemu_arm64 test.py

00:01:12

passed #207307
all
qemu_malta test.py

00:00:33

passed #207309
all
qemu_malta64 test.py

00:00:51

passed #207310
all
qemu_malta64el test.py

00:00:31

passed #207308
all
qemu_maltael test.py

00:00:51

passed #207303
all
qemu_mips test.py

00:00:51

passed #207305
all
qemu_mips64 test.py

00:00:29

passed #207306
all
qemu_mips64el test.py

00:00:32

passed #207304
all
qemu_mipsel test.py

00:00:26

passed #207318
all
r2dplus_i82557c test.py

00:00:52

passed #207319
all
r2dplus_pcnet test.py

00:00:26

passed #207320
all
r2dplus_rtl8139 test.py

00:00:33

passed #207321
all
r2dplus_tulip test.py

00:00:52

passed #207293
all
sandbox test.py

00:03:37

passed #207294
all
sandbox with clang test.py

00:02:54

passed #207297
all
sandbox_flattree test.py

00:00:46

passed #207295
all
sandbox_spl test.py

00:00:48

passed #207298
all
vexpress_ca15_tc2 test.py

00:00:26

passed #207299
all
vexpress_ca9x4 test.py

00:00:27

passed #207323
all
xilinx_versal_virt test.py

00:00:32

passed #207322
all
xilinx_zynq_virt test.py

00:00:29

passed #207324
all
xtfpga test.py

00:00:50

 
  World Build
skipped #207325
all
build all 32bit ARM platforms
skipped #207326
all
build all 64bit ARM platforms
skipped #207327
all
build all PowerPC platforms
skipped #207328
all
build all other platforms
 
Name Stage Failure
failed
qemu-x86_64 test.py Test.Py
+make[1]: *** [arch/x86/lib] Error 2
+make: *** [sub-make] Error 2
0 0 1 /1 qemu-x86_64
Completed: 1 total built, duration 0:00:11, rate 0.09
Running after_script
Running after script...
$ rm -rf /tmp/uboot-test-hooks /tmp/venv
Cleaning up file based variables
ERROR: Job failed: exit code 1
failed
qemu-x86 test.py Test.Py
+make[1]: *** wait: No child processes.  Stop.
+make: *** [sub-make] Error 2
0 0 1 /1 qemu-x86
Completed: 1 total built, duration 0:00:05, rate 0.20
Running after_script
Running after script...
$ rm -rf /tmp/uboot-test-hooks /tmp/venv
Uploading artifacts for failed job
ERROR: Job failed: exit code 1